Re: [CURRENT ISSUE] Save Error 532

by leroidetout
Reply

Original Post

Re: [CURRENT ISSUE] Save Error 532

★★★ Novice
@mikaelapersson15 yeah i was able to save up until 2 days ago when i first laod my game and start playing it lets me save and so i keep playing and it still lets me save but then all of a sudden it stops letting me and gives me an error i am so confused and annoyed as i just want to play the game that i payed alot of money for!
Message 91 of 201 (6,503 Views)
0

Re: [CURRENT ISSUE] Save Error 532

[ Edited ]
★ Guide

@33v0uwpgu02s for your error specifically, you need to delete shakeproductions 933 slippers

 

the long number in the errors (in your case 13955826978149017704) relates to the ID of a CC item

we've traced the number you have to be those slippers specifically

 

just realised though that you did have other numbers in some of the errors, so you may have multiple CC to find - the 50/50 will be good for you also

 

for @mikaelapersson15 and anyone else, please do a 50/50 to find the specific item causing your saving issues - we'd appreciate knowing more

Message 92 of 201 (6,491 Views)

Re: [CURRENT ISSUE] Save Error 532

★★★ Novice
@moxhollow thankyouuuuu!!!
Message 93 of 201 (6,492 Views)
0

Re: [CURRENT ISSUE] Save Error 532

[ Edited ]
★★ Apprentice

Hello, moxhollow.

I have been having the same issue ever since the release of High School Years and whenever I go to one specific lot, an MC Last Exception notification pops up.

Could you please try to trace the ID number of the mod that causes the issue? Though I am not sure that it will fix the problem. I have done a 50/50 so many times and with only clothing and hair mods the issue still reappears. 

Here is my notification:

Spoiler

 

  • File 'T:\InGame\Gameplay\Scripts\Server\areaserver.py', line 117, in wrapped [ finally_wrap : <function synchronous.__call__.<locals>.wrapped.<locals>.finally_wrap at 0x00007FF4C9D98C20>, run_callback : <function synchronous.__call__.<locals>.wrapped.<locals>.run_callback at 0x00007FF4C9D98CB0>, fn : <function c_api_client_connect at 0x00007FF48FCB28C0>, self : <areaserver.synchronous object at 0x00007FF48FCB4440>, args : (7, 1000732929094, 1014452807552402800, 'masunka77', 800531059558536871, <built-in method client_connect_completed of NoneType object at 0x0000000022B8C960>, 0, 'ru-ru', False)]
  • File 'T:\InGame\Gameplay\Scripts\Server\areaserver.py', line 113, in finally_wrap [ args : (7, 1000732929094, 1014452807552402800, 'masunka77', 800531059558536871, <built-in method client_connect_completed of NoneType object at 0x0000000022B8C960>, 0, 'ru-ru', False), ret : -1, fn : <function c_api_client_connect at 0x00007FF48FCB28C0>, run_callback : <function synchronous.__call__.<locals>.wrapped.<locals>.run_callback at 0x00007FF4C9D98CB0>]
  • File 'T:\InGame\Gameplay\Scripts\Server\areaserver.py', line 365, in c_api_client_connect [ session_id : 7, account_id : 1000732929094, household_id : 1014452807552402800, persona_name : masunka77, zone_id : 800531059558536871, callback : <built-in method client_connect_completed of NoneType object at 0x0000000022B8C960>, locale : ru-ru, account : ID: 1000732929094; SaveSlotID: 0; locale:ru-ru, zone : <Zone ID: 0xb1c0ec1dca756a7>, client : <Client 0x7>, spin_up_mode : FullZoneSpinUp, time_stamp : 1660014354.512578]
  • File 'sims4communitylib\utils\common_injection_utils.py', line 127, in _wrapped_function [ args : (<Zone ID: 0xb1c0ec1dca756a7>, 1014452807552402800, 0), new_function : <function _common_on_late_zone_load at 0x00007FF482C62CB0>, original_function : <function Zone.do_zone_spin_up at 0x00007FF486A05320>]
  • File 'sims4communitylib\events\zone_spin\common_zone_spin_event_dispatcher.py', line 76, in _common_on_late_zone_load [ original : <function Zone.do_zone_spin_up at 0x00007FF486A05320>, self : <Zone ID: 0xb1c0ec1dca756a7>, args : (1014452807552402800, 0)]
  • File 'T:\InGame\Gameplay\Scripts\Server\zone.py', line 576, in do_zone_spin_up [ self : <Zone ID: 0xb1c0ec1dca756a7>, household_id : 1014452807552402800, game_clock : game_clock, time_service : time_service]
  • File 'C:\Users\79272\Documents\Electronic Arts\The Sims 4\Mods\NO CALLS\MTS_Scumbumbo_UnlistedPhoneNumbers_SCRIPT.ts4script\injector.py', line 11, in _inject [ args : (<time_service.TimeService object at 0x00007FF44D8EE850>,), kwargs : {'time_slice': False}, new_function : <function update at 0x00007FF47FB26950>, target_function : <function TimeService.update at 0x00007FF485A479E0>]
  • File 'S:\Workspace\+SrslySims\Gameplay\Simulation Lag Fix\Scripts\SimulationLagFix.py', line 34, in update [ original : <function TimeService.update at 0x00007FF485A479E0>, self : time_service, time3 : 269957.343]
  • File 'T:\InGame\Gameplay\Scripts\Server\time_service.py', line 117, in update [ self : time_service]
  • File 'T:\InGame\Gameplay\Scripts\Server\scheduling.py', line 238, in simulate [ self : <scheduling.Timeline object at 0x00007FF461788B90>, until : 21:31:03.280 day:0 week:0, max_elements : 10000, count : 974, handle : [None, None, <scheduling.Timeline object at 0x00007FF461788B90>, False, <Gen; Sim._startup_sim_gen@2842; dead>], when : 21:31:03.280 day:0 week:0, _ : 3475, _t : <scheduling.Timeline object at 0x00007FF461788B90>, _s : True, e : <Gen; Sim._startup_sim_gen@2842; dead>, result : True, exc : 'NoneType' object has no attribute 'get_priority']
  • File 'T:\InGame\Gameplay\Scripts\Server\scheduling.py', line 725, in _report_exception [ self : <scheduling.Timeline object at 0x00007FF461788B90>, element : <Gen; Sim._startup_sim_gen@2842; dead>, exception : 'NoneType' object has no attribute 'get_priority', message : Exception resuming Element]
  • File 'T:\InGame\Gameplay\Scripts\Server\time_service.py', line 196, in _on_exception [ self : time_service, timeline : <scheduling.Timeline object at 0x00007FF461788B90>, element : <Gen; Sim._startup_sim_gen@2842; dead>, exception : 'NoneType' object has no attribute 'get_priority', message : Exception resuming Element, name : Sim Timeline]
  • File 'sims4communitylib\utils\common_injection_utils.py', line 127, in _wrapped_function [ args : (<sims4.log.Logger object at 0x00007FF485A481D0>, 'Exception in {}: {}', 'Sim Timeline', 'Exception resuming Element'), kwargs : {'exc': AttributeError("'NoneType' object has no attribute 'get_priority'"), 'log_current_callstack': False}, new_function : <function _common_logger_exception at 0x00007FF482D2D9E0>, original_function : <function Logger.exception at 0x00007FF4D9DC0B90>]
  • File 'sims4communitylib\logging\vanilla_logging.py', line 164, in _common_logger_exception [ original : <function Logger.exception at 0x00007FF4D9DC0B90>, self : <sims4.log.Logger object at 0x00007FF485A481D0>, message : Exception in {}: {}, exc : 'NoneType' object has no attribute 'get_priority', args : ('Sim Timeline', 'Exception resuming Element'), kwargs : {'log_current_callstack': False}, log_name : TimeService]
  • File 'T:\InGame\Gameplay\Scripts\Server\elements.py', line 390, in _resume [ self : <Gen; Sim._startup_sim_gen@2842; dead>, timeline : <scheduling.Timeline object at 0x00007FF461788B90>, child_result : True]
  • File 'T:\InGame\Gameplay\Scripts\Server\sims\sim.py', line 3015, in _startup_sim_gen [ timeline : <scheduling.Timeline object at 0x00007FF461788B90>, previous_simulation_state : SimulationState.INITIALIZING, school_data : SchoolTuning(school_data=_sims4_collections.frozendict({<Age.CHILD = 4>: _SchoolData(school_career=<class 'sims4.tuning.instances.career_Child_GradeSchool'>, school_homework=<Definition: 19136>), <Age.TEEN = 8>: _SchoolData(school_career=<class 'sims4.tuning.instances.career_Teen_HighSchool'>, school_homework=<Definition: 18497>)}), school_data_tests=CompoundTestList([(TraitTest(apply_thresholds_on_individual_basis=True, blacklist_trait_types=frozenset(), blacklist_traits=(<class 'sims4.tuning.instances.trait_HSExit_Dropout'>, <class 'sims4.tuning.instances.trait_HSExit_Expelled'>, <class 'sims4.tuning.instances.trait_HSExit_Graduate_Early'>), num_blacklist_allowed=0, num_whitelist_required=1, subject=ParticipantType.Actor, tooltip=None, whitelist_trait_types=frozenset(), whitelist_traits=()),)])), commodity : Commodity(commodity_Trait_Autonomy_WeatherPreference_LovesRain@-33.541991228087696), owning_household_of_active_lot : Household Гандия-Абреу (1014452807552402800): Себастьян Гандия; Дафна Абреу; Андре Периссе; Аура Гандия; Изабела, target_sim_info : Изабела, situation_manager : situation_manager, buff : <class 'sims4.tuning.instances.Buff_Motives_AllMotivesPrettyHigh'>, multi_motive_buff_motives : _sims4_collections.frozendict({<class 'sims4.tuning.instances.motive_Bladder'>: <Threshold >= -25.0>, <class 'sims4.tuning.instances.motive_Energy'>: <Threshold >= -25.0>, <class 'sims4.tuning.instances.motive_Fun'>: <Threshold >= 50.0>, <class 'sims4.tuning.instances.motive_Hunger'>: <Threshold >= -25.0>, <class 'sims4.tuning.instances.motive_Hygiene'>: <Threshold >= 50.0>, <class 'sims4.tuning.instances.motive_Social'>: <Threshold >= 50.0>, <class 'sims4.tuning.instances.Commodity_Buff_AllMotivesHighGate'>: <Threshold < 100.0>}), static_commodity_type : <class 'sims4.tuning.instances.StaticCommodity_Tidy'>, self : Андре Периссе]
  • File 'T:\InGame\Gameplay\Scripts\Server\whims\whims_tracker.py', line 498, in start_whims_tracker [ self : <whims.whims_tracker.WhimsTracker object at 0x00007FF44E18D090>]
  • File 'T:\InGame\Gameplay\Scripts\Server\whims\whims_tracker.py', line 1405, in _populate_slots [ self : <whims.whims_tracker.WhimsTracker object at 0x00007FF44E18D090>, whim_slot : SlotData(Whim: None, Goal: None, Intended Type: WhimType.REACTIONARY, Whimset: None, Last Refresh: 0, Locked: False), possible_whimset_data : '{<class 'sims4.tuning.instances.Whimset_Asp_Fortune_Wealthy'>: <whims.whims_tracker.WhimsTracker.ActiveWhimsetData object at 0x00007FF4569E3B90>, <class 'sims4.tuning.instances.whimset_HasCelebrityTrait'>: <whims.whims_tracker.WhimsTracker.ActiveWhimsetData object at 0x00007FF4569E3490>, <class 'sims4.tuning.instances.whimset_HasTraitUnfeeling'>: <whims.whims_tracker.WhimsTracker.ActiveWhimsetData object at 0x00007FF4569E3890>, <class 'sims4.tuning.instances.whimset_HasTraitResponsible'>: <whims.whims_tracker.WhimsTracker.ActiveWhimsetData object at 0x00007FF457573F90>, <class 'sims4.tuning.instances.whimset_HasTraitLifeSkills_Argumentative'>: <whims.whims_tracker.WhimsTracker.ActiveWhimsetData object at 0x00007FF457573E50>, <class 'sims4.tuning.instances.whimset_HasTraitLifeSkills_BadManners'>: <whims.whims_tracker.WhimsTracker.ActiveWhimsetData object at 0x00007FF457573810>, <class 'sims4.tuning.instances.whimset_HasTraitSelfAssured'>: <whims.whims_tracker.WhimsTracker.ActiveWhimsetData object at 0x00007FF4...', possible_whimsets : {<class 'sims4.tuning.instances.whimset_HasTraitUnfeeling'>, <class 'sims4.tuning.instances.whimset_HasTraitHotheaded'>, <class 'sims4.tuning.instances.whimset_HasCelebrityTrait'>, <class 'sims4.tuning.instances.Whimset_Asp_Fortune_Wealthy'>, <class 'sims4.tuning.instances.whimset_HasTraitLifeSkills_BadManners'>, <class 'sims4.tuning.instances.whimSet_Partner'>, <class 'sims4.tuning.instances.whimset_Trait_LikedMusic_DJ'>, <class 'sims4.tuning.instances.whimset_Motives'>, <class 'sims4.tuning.instances.whimSet_Acquaintance'>, <class 'sims4.tuning.instances.whimSet_Enemy_Progress'>, None, <class 'sims4.tuning.instances.whimset_Trait_LikedMusic_Electronica'>, <class 'sims4.tuning.instances.whimset_HasTraitUncontrolledEmotion'>, <class 'sims4.tuning.instances.whimset_HasTraitLifeSkills_Argumentative'>, <class 'sims4.tuning.instances.whimset_HasTraitResponsible'>}, prioritized_whimsets : [(10.0, <class 'sims4.tuning.instances.whimset_HasTraitUnfeeling'>), (10.0, <class 'sims4.tuning.instances.whimset_HasTraitHotheaded'>), (10.0, <class 'sims4.tuning.instances.whimset_HasCelebrityTrait'>), (10.0, <class 'sims4.tuning.instances.Whimset_Asp_Fortune_Wealthy'>), (10.0, <class 'sims4.tuning.instances.whimset_HasTraitLifeSkills_BadManners'>), (2.0, <class 'sims4.tuning.instances.whimSet_Partner'>), (10.0, <class 'sims4.tuning.instances.whimset_Trait_LikedMusic_DJ'>), (10.0, <class 'sims4.tuning.instances.whimset_Motives'>), (2.0, <class 'sims4.tuning.instances.whimSet_Acquaintance'>), (2.0, <class 'sims4.tuning.instances.whimSet_Enemy_Progress'>)], priority : 2.0]
  • File 'T:\InGame\Gameplay\Scripts\Server\whims\whims_tracker.py', line 638, in get_priority [ self : <whims.whims_tracker.WhimsTracker object at 0x00007FF44E18D090>]
  •  
Message 94 of 201 (6,459 Views)
0

Re: [CURRENT ISSUE] Save Error 532

[ Edited ]
★★ Novice

I've tried the 50/50 and it seems like it doesn't work at all. I can barely play even a full sim day with my current save file. I even started a whole new game to see if I could play with my mods in that save file. And so far it seems to work perfectly fine. But on my other save file I keep getting this message...

I have put in alot of time and work on my save file so I hope i don't have to start over.

 

 

Spoiler
<?xml version="1.0" ?><root>
<BetterExceptions><BEversion>v2.04</BEversion><WasBlank>False</WasBlank><TuningLoadFinished>True</TuningLoadFinished><BadObjectCC>False</BadObjectCC><Advice>Not available. More info may be in BE Report.</Advice></BetterExceptions><report><version>2</version><sessionid>18d32b827ee696d262f2773c</sessionid><type>desync</type><sku>ea.maxis.sims4_64.15.pc</sku><createtime>2022-08-09 17:10:00</createtime><buildsignature>Local.Unknown.Unknown.1.90.375.1020-1.300.000.144.Release</buildsignature><categoryid>cpp_message.py:145</categoryid><desyncid>18d32b827ee696d262f2773c</desyncid><systemconfig/><screenshot/><desyncdata>[manus] Save failed due to Exception (ValueError: Value out of range: 16300434637883307408)&#13;&#10;Traceback (most recent call last):&#13;&#10;Caught and logged:&#13;&#10;&#13;&#10; File "T:\InGame\Gameplay\Scripts\Server\services\persistence_service.py", line 560, in _fill_and_send_save_game_protobufs_gen&#13;&#10; File "T:\InGame\Gameplay\Scripts\Core\sims4\service_manager.py", line 514, in save_all_services&#13;&#10; File "T:\InGame\Gameplay\Scripts\Server\zone_manager.py", line 118, in save&#13;&#10; File "T:\InGame\Gameplay\Scripts\Server\zone.py", line 1659, in save_zone&#13;&#10; File "T:\InGame\Gameplay\Scripts\Server\game_services.py", line 46, in save_all_services&#13;&#10; File "T:\InGame\Gameplay\Scripts\Core\sims4\service_manager.py", line 514, in save_all_services&#13;&#10; File "T:\InGame\Gameplay\Scripts\Server\fashion_trends\fashion_trend_service.py", line 94, in save&#13;&#10; File "T:\InGame\Gameplay\Scripts\Core\google\protobuf\internal\cpp_message.py", line 149, in extend&#13;&#10; File "T:\InGame\Gameplay\Scripts\Core\google\protobuf\internal\cpp_message.py", line 145, in append&#13;&#10;ValueError: Value out of range: 16300434637883307408rtim=0&#13;&#10;Client Session Time: 17.99&#13; &#10;Num Save Errors: 0&#13; &#10;Num Load Errors: 0&#13; &#10;Current Game State: 0x96d01090&#13; &#10;LoadingScreenActiveFlag: 1&#13; &#10;Origin Version: 10,5,114,51455&#13; &#10;Modded: True&#13; &#10;SystemInfo: Windows 10 10.0.19044 GPU: NVIDIA GeForce GTX 1060 6GB nvldumdx.dll 30.0.14.7239, GUID: D7B71E3E-5F43-11CF-956B-9E140EC2D335&#13; &#10;</desyncdata></report>
<report><version>2</version><sessionid>18d32b827ee696d262f2773c</sessionid><type>desync</type><sku>ea.maxis.sims4_64.15.pc</sku><createtime>2022-08-09 17:12:27</createtime><buildsignature>Local.Unknown.Unknown.1.90.375.1020-1.300.000.144.Release</buildsignature><categoryid>cpp_message.py:145</categoryid><desyncid>18d32b827ee696d262f2773c</desyncid><systemconfig/><screenshot/><desyncdata>[manus] Save failed due to Exception (ValueError: Value out of range: 16300434637883307408)&#13;&#10;Traceback (most recent call last):&#13;&#10;Caught and logged:&#13;&#10;&#13;&#10; File "T:\InGame\Gameplay\Scripts\Server\services\persistence_service.py", line 560, in _fill_and_send_save_game_protobufs_gen&#13;&#10; File "T:\InGame\Gameplay\Scripts\Core\sims4\service_manager.py", line 514, in save_all_services&#13;&#10; File "T:\InGame\Gameplay\Scripts\Server\zone_manager.py", line 118, in save&#13;&#10; File "T:\InGame\Gameplay\Scripts\Server\zone.py", line 1659, in save_zone&#13;&#10; File "T:\InGame\Gameplay\Scripts\Server\game_services.py", line 46, in save_all_services&#13;&#10; File "T:\InGame\Gameplay\Scripts\Core\sims4\service_manager.py", line 514, in save_all_services&#13;&#10; File "T:\InGame\Gameplay\Scripts\Server\fashion_trends\fashion_trend_service.py", line 94, in save&#13;&#10; File "T:\InGame\Gameplay\Scripts\Core\google\protobuf\internal\cpp_message.py", line 149, in extend&#13;&#10; File "T:\InGame\Gameplay\Scripts\Core\google\protobuf\internal\cpp_message.py", line 145, in append&#13;&#10;ValueError: Value out of range: 16300434637883307408rtim=0&#13;&#10;Client Session Time: 17.99&#13; &#10;Num Save Errors: 0&#13; &#10;Num Load Errors: 0&#13; &#10;Current Game State: 0x96d01090&#13; &#10;LoadingScreenActiveFlag: 1&#13; &#10;Origin Version: 10,5,114,51455&#13; &#10;Modded: True&#13; &#10;SystemInfo: Windows 10 10.0.19044 GPU: NVIDIA GeForce GTX 1060 6GB nvldumdx.dll 30.0.14.7239, GUID: D7B71E3E-5F43-11CF-956B-9E140EC2D335&#13; &#10;</desyncdata></report>
<report><version>2</version><sessionid>18d32b827ee696d262f2773c</sessionid><type>desync</type><sku>ea.maxis.sims4_64.15.pc</sku><createtime>2022-08-09 17:12:52</createtime><buildsignature>Local.Unknown.Unknown.1.90.375.1020-1.300.000.144.Release</buildsignature><categoryid>cpp_message.py:145</categoryid><desyncid>18d32b827ee696d262f2773c</desyncid><systemconfig/><screenshot/><desyncdata>[manus] Save failed due to Exception (ValueError: Value out of range: 16300434637883307408)&#13;&#10;Traceback (most recent call last):&#13;&#10;Caught and logged:&#13;&#10;&#13;&#10; File "T:\InGame\Gameplay\Scripts\Server\services\persistence_service.py", line 560, in _fill_and_send_save_game_protobufs_gen&#13;&#10; File "T:\InGame\Gameplay\Scripts\Core\sims4\service_manager.py", line 514, in save_all_services&#13;&#10; File "T:\InGame\Gameplay\Scripts\Server\zone_manager.py", line 118, in save&#13;&#10; File "T:\InGame\Gameplay\Scripts\Server\zone.py", line 1659, in save_zone&#13;&#10; File "T:\InGame\Gameplay\Scripts\Server\game_services.py", line 46, in save_all_services&#13;&#10; File "T:\InGame\Gameplay\Scripts\Core\sims4\service_manager.py", line 514, in save_all_services&#13;&#10; File "T:\InGame\Gameplay\Scripts\Server\fashion_trends\fashion_trend_service.py", line 94, in save&#13;&#10; File "T:\InGame\Gameplay\Scripts\Core\google\protobuf\internal\cpp_message.py", line 149, in extend&#13;&#10; File "T:\InGame\Gameplay\Scripts\Core\google\protobuf\internal\cpp_message.py", line 145, in append&#13;&#10;ValueError: Value out of range: 16300434637883307408rtim=0&#13;&#10;Client Session Time: 17.99&#13; &#10;Num Save Errors: 0&#13; &#10;Num Load Errors: 0&#13; &#10;Current Game State: 0x96d01090&#13; &#10;LoadingScreenActiveFlag: 1&#13; &#10;Origin Version: 10,5,114,51455&#13; &#10;Modded: True&#13; &#10;SystemInfo: Windows 10 10.0.19044 GPU: NVIDIA GeForce GTX 1060 6GB nvldumdx.dll 30.0.14.7239, GUID: D7B71E3E-5F43-11CF-956B-9E140EC2D335&#13; &#10;</desyncdata></report>
<report><version>2</version><sessionid>18d32b827ee696d262f2773c</sessionid><type>desync</type><sku>ea.maxis.sims4_64.15.pc</sku><createtime>2022-08-09 17:30:14</createtime><buildsignature>Local.Unknown.Unknown.1.90.375.1020-1.300.000.144.Release</buildsignature><categoryid>cpp_message.py:145</categoryid><desyncid>18d32b827ee696d262f2773c</desyncid><systemconfig/><screenshot/><desyncdata>[manus] Save failed due to Exception (ValueError: Value out of range: 15726944920160552886)&#13;&#10;Traceback (most recent call last):&#13;&#10;Caught and logged:&#13;&#10;&#13;&#10; File "T:\InGame\Gameplay\Scripts\Server\services\persistence_service.py", line 560, in _fill_and_send_save_game_protobufs_gen&#13;&#10; File "T:\InGame\Gameplay\Scripts\Core\sims4\service_manager.py", line 514, in save_all_services&#13;&#10; File "T:\InGame\Gameplay\Scripts\Server\zone_manager.py", line 118, in save&#13;&#10; File "T:\InGame\Gameplay\Scripts\Server\zone.py", line 1659, in save_zone&#13;&#10; File "T:\InGame\Gameplay\Scripts\Server\game_services.py", line 46, in save_all_services&#13;&#10; File "T:\InGame\Gameplay\Scripts\Core\sims4\service_manager.py", line 514, in save_all_services&#13;&#10; File "T:\InGame\Gameplay\Scripts\Server\fashion_trends\fashion_trend_service.py", line 94, in save&#13;&#10; File "T:\InGame\Gameplay\Scripts\Core\google\protobuf\internal\cpp_message.py", line 149, in extend&#13;&#10; File "T:\InGame\Gameplay\Scripts\Core\google\protobuf\internal\cpp_message.py", line 145, in append&#13;&#10;ValueError: Value out of range: 15726944920160552886rtim=0&#13;&#10;Client Session Time: 17.99&#13; &#10;Num Save Errors: 0&#13; &#10;Num Load Errors: 0&#13; &#10;Current Game State: 0x96d01090&#13; &#10;LoadingScreenActiveFlag: 1&#13; &#10;Origin Version: 10,5,114,51455&#13; &#10;Modded: True&#13; &#10;SystemInfo: Windows 10 10.0.19044 GPU: NVIDIA GeForce GTX 1060 6GB nvldumdx.dll 30.0.14.7239, GUID: D7B71E3E-5F43-11CF-956B-9E140EC2D335&#13; &#10;</desyncdata></report>
<report><version>2</version><sessionid>18d32b827ee696d262f2773c</sessionid><type>desync</type><sku>ea.maxis.sims4_64.15.pc</sku><createtime>2022-08-09 17:30:52</createtime><buildsignature>Local.Unknown.Unknown.1.90.375.1020-1.300.000.144.Release</buildsignature><categoryid>cpp_message.py:145</categoryid><desyncid>18d32b827ee696d262f2773c</desyncid><systemconfig/><screenshot/><desyncdata>[manus] Save failed due to Exception (ValueError: Value out of range: 15726944920160552886)&#13;&#10;Traceback (most recent call last):&#13;&#10;Caught and logged:&#13;&#10;&#13;&#10; File "T:\InGame\Gameplay\Scripts\Server\services\persistence_service.py", line 560, in _fill_and_send_save_game_protobufs_gen&#13;&#10; File "T:\InGame\Gameplay\Scripts\Core\sims4\service_manager.py", line 514, in save_all_services&#13;&#10; File "T:\InGame\Gameplay\Scripts\Server\zone_manager.py", line 118, in save&#13;&#10; File "T:\InGame\Gameplay\Scripts\Server\zone.py", line 1659, in save_zone&#13;&#10; File "T:\InGame\Gameplay\Scripts\Server\game_services.py", line 46, in save_all_services&#13;&#10; File "T:\InGame\Gameplay\Scripts\Core\sims4\service_manager.py", line 514, in save_all_services&#13;&#10; File "T:\InGame\Gameplay\Scripts\Server\fashion_trends\fashion_trend_service.py", line 94, in save&#13;&#10; File "T:\InGame\Gameplay\Scripts\Core\google\protobuf\internal\cpp_message.py", line 149, in extend&#13;&#10; File "T:\InGame\Gameplay\Scripts\Core\google\protobuf\internal\cpp_message.py", line 145, in append&#13;&#10;ValueError: Value out of range: 15726944920160552886rtim=0&#13;&#10;Client Session Time: 17.99&#13; &#10;Num Save Errors: 0&#13; &#10;Num Load Errors: 0&#13; &#10;Current Game State: 0x96d01090&#13; &#10;LoadingScreenActiveFlag: 1&#13; &#10;Origin Version: 10,5,114,51455&#13; &#10;Modded: True&#13; &#10;SystemInfo: Windows 10 10.0.19044 GPU: NVIDIA GeForce GTX 1060 6GB nvldumdx.dll 30.0.14.7239, GUID: D7B71E3E-5F43-11CF-956B-9E140EC2D335&#13; &#10;</desyncdata></report>
<report><version>2</version><sessionid>18d32b827ee696d262f2773c</sessionid><type>desync</type><sku>ea.maxis.sims4_64.15.pc</sku><createtime>2022-08-09 17:30:53</createtime><buildsignature>Local.Unknown.Unknown.1.90.375.1020-1.300.000.144.Release</buildsignature><categoryid>cpp_message.py:145</categoryid><desyncid>18d32b827ee696d262f2773c</desyncid><systemconfig/><screenshot/><desyncdata>[manus] Save failed due to Exception (ValueError: Value out of range: 15726944920160552886)&#13;&#10;Traceback (most recent call last):&#13;&#10;Caught and logged:&#13;&#10;&#13;&#10; File "T:\InGame\Gameplay\Scripts\Server\services\persistence_service.py", line 560, in _fill_and_send_save_game_protobufs_gen&#13;&#10; File "T:\InGame\Gameplay\Scripts\Core\sims4\service_manager.py", line 514, in save_all_services&#13;&#10; File "T:\InGame\Gameplay\Scripts\Server\zone_manager.py", line 118, in save&#13;&#10; File "T:\InGame\Gameplay\Scripts\Server\zone.py", line 1659, in save_zone&#13;&#10; File "T:\InGame\Gameplay\Scripts\Server\game_services.py", line 46, in save_all_services&#13;&#10; File "T:\InGame\Gameplay\Scripts\Core\sims4\service_manager.py", line 514, in save_all_services&#13;&#10; File "T:\InGame\Gameplay\Scripts\Server\fashion_trends\fashion_trend_service.py", line 94, in save&#13;&#10; File "T:\InGame\Gameplay\Scripts\Core\google\protobuf\internal\cpp_message.py", line 149, in extend&#13;&#10; File "T:\InGame\Gameplay\Scripts\Core\google\protobuf\internal\cpp_message.py", line 145, in append&#13;&#10;ValueError: Value out of range: 15726944920160552886rtim=0&#13;&#10;Client Session Time: 17.99&#13; &#10;Num Save Errors: 0&#13; &#10;Num Load Errors: 0&#13; &#10;Current Game State: 0x96d01090&#13; &#10;LoadingScreenActiveFlag: 1&#13; &#10;Origin Version: 10,5,114,51455&#13; &#10;Modded: True&#13; &#10;SystemInfo: Windows 10 10.0.19044 GPU: NVIDIA GeForce GTX 1060 6GB nvldumdx.dll 30.0.14.7239, GUID: D7B71E3E-5F43-11CF-956B-9E140EC2D335&#13; &#10;</desyncdata></report>
<report><version>2</version><sessionid>18d32b827ee696d262f2773c</sessionid><type>desync</type><sku>ea.maxis.sims4_64.15.pc</sku><createtime>2022-08-09 17:32:53</createtime><buildsignature>Local.Unknown.Unknown.1.90.375.1020-1.300.000.144.Release</buildsignature><categoryid>cpp_message.py:145</categoryid><desyncid>18d32b827ee696d262f2773c</desyncid><systemconfig/><screenshot/><desyncdata>[manus] Save failed due to Exception (ValueError: Value out of range: 17224306841669434955)&#13;&#10;Traceback (most recent call last):&#13;&#10;Caught and logged:&#13;&#10;&#13;&#10; File "T:\InGame\Gameplay\Scripts\Server\services\persistence_service.py", line 560, in _fill_and_send_save_game_protobufs_gen&#13;&#10; File "T:\InGame\Gameplay\Scripts\Core\sims4\service_manager.py", line 514, in save_all_services&#13;&#10; File "T:\InGame\Gameplay\Scripts\Server\zone_manager.py", line 118, in save&#13;&#10; File "T:\InGame\Gameplay\Scripts\Server\zone.py", line 1659, in save_zone&#13;&#10; File "T:\InGame\Gameplay\Scripts\Server\game_services.py", line 46, in save_all_services&#13;&#10; File "T:\InGame\Gameplay\Scripts\Core\sims4\service_manager.py", line 514, in save_all_services&#13;&#10; File "T:\InGame\Gameplay\Scripts\Server\fashion_trends\fashion_trend_service.py", line 94, in save&#13;&#10; File "T:\InGame\Gameplay\Scripts\Core\google\protobuf\internal\cpp_message.py", line 149, in extend&#13;&#10; File "T:\InGame\Gameplay\Scripts\Core\google\protobuf\internal\cpp_message.py", line 145, in append&#13;&#10;ValueError: Value out of range: 17224306841669434955rtim=0&#13;&#10;Client Session Time: 17.99&#13; &#10;Num Save Errors: 0&#13; &#10;Num Load Errors: 0&#13; &#10;Current Game State: 0x96d01090&#13; &#10;LoadingScreenActiveFlag: 1&#13; &#10;Origin Version: 10,5,114,51455&#13; &#10;Modded: True&#13; &#10;SystemInfo: Windows 10 10.0.19044 GPU: NVIDIA GeForce GTX 1060 6GB nvldumdx.dll 30.0.14.7239, GUID: D7B71E3E-5F43-11CF-956B-9E140EC2D335&#13; &#10;</desyncdata></report>
<report><version>2</version><sessionid>18d32b827ee696d262f2773c</sessionid><type>desync</type><sku>ea.maxis.sims4_64.15.pc</sku><createtime>2022-08-09 17:33:10</createtime><buildsignature>Local.Unknown.Unknown.1.90.375.1020-1.300.000.144.Release</buildsignature><categoryid>cpp_message.py:145</categoryid><desyncid>18d32b827ee696d262f2773c</desyncid><systemconfig/><screenshot/><desyncdata>[manus] Save failed due to Exception (ValueError: Value out of range: 17224306841669434955)&#13;&#10;Traceback (most recent call last):&#13;&#10;Caught and logged:&#13;&#10;&#13;&#10; File "T:\InGame\Gameplay\Scripts\Server\services\persistence_service.py", line 560, in _fill_and_send_save_game_protobufs_gen&#13;&#10; File "T:\InGame\Gameplay\Scripts\Core\sims4\service_manager.py", line 514, in save_all_services&#13;&#10; File "T:\InGame\Gameplay\Scripts\Server\zone_manager.py", line 118, in save&#13;&#10; File "T:\InGame\Gameplay\Scripts\Server\zone.py", line 1659, in save_zone&#13;&#10; File "T:\InGame\Gameplay\Scripts\Server\game_services.py", line 46, in save_all_services&#13;&#10; File "T:\InGame\Gameplay\Scripts\Core\sims4\service_manager.py", line 514, in save_all_services&#13;&#10; File "T:\InGame\Gameplay\Scripts\Server\fashion_trends\fashion_trend_service.py", line 94, in save&#13;&#10; File "T:\InGame\Gameplay\Scripts\Core\google\protobuf\internal\cpp_message.py", line 149, in extend&#13;&#10; File "T:\InGame\Gameplay\Scripts\Core\google\protobuf\internal\cpp_message.py", line 145, in append&#13;&#10;ValueError: Value out of range: 17224306841669434955rtim=0&#13;&#10;Client Session Time: 17.99&#13; &#10;Num Save Errors: 0&#13; &#10;Num Load Errors: 0&#13; &#10;Current Game State: 0x96d01090&#13; &#10;LoadingScreenActiveFlag: 1&#13; &#10;Origin Version: 10,5,114,51455&#13; &#10;Modded: True&#13; &#10;SystemInfo: Windows 10 10.0.19044 GPU: NVIDIA GeForce GTX 1060 6GB nvldumdx.dll 30.0.14.7239, GUID: D7B71E3E-5F43-11CF-956B-9E140EC2D335&#13; &#10;</desyncdata></report>
<report><version>2</version><sessionid>18d32b827ee696d262f2773c</sessionid><type>desync</type><sku>ea.maxis.sims4_64.15.pc</sku><createtime>2022-08-09 17:33:12</createtime><buildsignature>Local.Unknown.Unknown.1.90.375.1020-1.300.000.144.Release</buildsignature><categoryid>cpp_message.py:145</categoryid><desyncid>18d32b827ee696d262f2773c</desyncid><systemconfig/><screenshot/><desyncdata>[manus] Save failed due to Exception (ValueError: Value out of range: 17224306841669434955)&#13;&#10;Traceback (most recent call last):&#13;&#10;Caught and logged:&#13;&#10;&#13;&#10; File "T:\InGame\Gameplay\Scripts\Server\services\persistence_service.py", line 560, in _fill_and_send_save_game_protobufs_gen&#13;&#10; File "T:\InGame\Gameplay\Scripts\Core\sims4\service_manager.py", line 514, in save_all_services&#13;&#10; File "T:\InGame\Gameplay\Scripts\Server\zone_manager.py", line 118, in save&#13;&#10; File "T:\InGame\Gameplay\Scripts\Server\zone.py", line 1659, in save_zone&#13;&#10; File "T:\InGame\Gameplay\Scripts\Server\game_services.py", line 46, in save_all_services&#13;&#10; File "T:\InGame\Gameplay\Scripts\Core\sims4\service_manager.py", line 514, in save_all_services&#13;&#10; File "T:\InGame\Gameplay\Scripts\Server\fashion_trends\fashion_trend_service.py", line 94, in save&#13;&#10; File "T:\InGame\Gameplay\Scripts\Core\google\protobuf\internal\cpp_message.py", line 149, in extend&#13;&#10; File "T:\InGame\Gameplay\Scripts\Core\google\protobuf\internal\cpp_message.py", line 145, in append&#13;&#10;ValueError: Value out of range: 17224306841669434955rtim=0&#13;&#10;Client Session Time: 17.99&#13; &#10;Num Save Errors: 0&#13; &#10;Num Load Errors: 0&#13; &#10;Current Game State: 0x96d01090&#13; &#10;LoadingScreenActiveFlag: 1&#13; &#10;Origin Version: 10,5,114,51455&#13; &#10;Modded: True&#13; &#10;SystemInfo: Windows 10 10.0.19044 GPU: NVIDIA GeForce GTX 1060 6GB nvldumdx.dll 30.0.14.7239, GUID: D7B71E3E-5F43-11CF-956B-9E140EC2D335&#13; &#10;</desyncdata></report>
</root>
Message 95 of 201 (6,336 Views)
0

Re: Save Error 532

★★ Apprentice

Here's my last exception <3

 

Spoiler
<?xml version="1.0" ?><root>
<report><version>2</version><sessionid>286bbe9b870bc9e62f2564d</sessionid><type>desync</type><sku>ea.maxis.sims4_64.15.pc</sku><createtime>2022-08-09 16:42:48</createtime><buildsignature>Local.Unknown.Unknown.1.90.375.1020-1.300.000.144.Release</buildsignature><categoryid>exit_condition_manager.py:61</categoryid><desyncid>286bbe9b870bc9e62f2564d</desyncid><systemconfig/><screenshot/><desyncdata>Exception in Sim Timeline: Exception running Element (AttributeError: 'NoneType' object has no attribute 'in_minutes')&#13;&#10;Traceback (most recent call last):&#13;&#10; File "T:\InGame\Gameplay\Scripts\Server\scheduling.py", line 216, in simulate&#13;&#10; File "T:\InGame\Gameplay\Scripts\Server\elements.py", line 335, in _run&#13;&#10; File "T:\InGame\Gameplay\Scripts\Server\interactions\base\interaction.py", line 6351, in &lt;lambda&gt;&#13;&#10; File "T:\InGame\Gameplay\Scripts\Server\interactions\base\interaction.py", line 6082, in attach_conditional_actions&#13;&#10; File "T:\InGame\Gameplay\Scripts\Server\interactions\utils\exit_condition_manager.py", line 194, in attach_conditions&#13;&#10; File "T:\InGame\Gameplay\Scripts\Server\interactions\utils\exit_condition_manager.py", line 61, in attach&#13;&#10; File "T:\InGame\Gameplay\Scripts\Server\statistics\statistic_conditions.py", line 842, in attach_to_ownerAttributeError: 'NoneType' object has no attribute 'in_minutes'rtim=0&#13;&#10;ClientInfo isn't here</desyncdata></report>
<report><version>2</version><sessionid>286bbe9b870bc9e62f2564d</sessionid><type>desync</type><sku>ea.maxis.sims4_64.15.pc</sku><createtime>2022-08-09 16:42:52</createtime><buildsignature>Local.Unknown.Unknown.1.90.375.1020-1.300.000.144.Release</buildsignature><categoryid>exit_condition_manager.py:61</categoryid><desyncid>286bbe9b870bc9e62f2564d</desyncid><systemconfig/><screenshot/><desyncdata>Exception in Sim Timeline: Exception running Element (AttributeError: 'NoneType' object has no attribute 'in_minutes')&#13;&#10;Traceback (most recent call last):&#13;&#10; File "T:\InGame\Gameplay\Scripts\Server\scheduling.py", line 216, in simulate&#13;&#10; File "T:\InGame\Gameplay\Scripts\Server\elements.py", line 335, in _run&#13;&#10; File "T:\InGame\Gameplay\Scripts\Server\interactions\base\interaction.py", line 6351, in &lt;lambda&gt;&#13;&#10; File "T:\InGame\Gameplay\Scripts\Server\interactions\base\interaction.py", line 6082, in attach_conditional_actions&#13;&#10; File "T:\InGame\Gameplay\Scripts\Server\interactions\utils\exit_condition_manager.py", line 194, in attach_conditions&#13;&#10; File "T:\InGame\Gameplay\Scripts\Server\interactions\utils\exit_condition_manager.py", line 61, in attach&#13;&#10; File "T:\InGame\Gameplay\Scripts\Server\statistics\statistic_conditions.py", line 842, in attach_to_ownerAttributeError: 'NoneType' object has no attribute 'in_minutes'rtim=0&#13;&#10;ClientInfo isn't here</desyncdata></report>
<report><version>2</version><sessionid>286bbe9b870bc9e62f2564d</sessionid><type>desync</type><sku>ea.maxis.sims4_64.15.pc</sku><createtime>2022-08-09 18:21:11</createtime><buildsignature>Local.Unknown.Unknown.1.90.375.1020-1.300.000.144.Release</buildsignature><categoryid>cpp_message.py:145</categoryid><desyncid>286bbe9b870bc9e62f2564d</desyncid><systemconfig/><screenshot/><desyncdata>[manus] Save failed due to Exception (ValueError: Value out of range: 17461224500453361867)&#13;&#10;Traceback (most recent call last):&#13;&#10;Caught and logged:&#13;&#10;&#13;&#10; File "T:\InGame\Gameplay\Scripts\Server\services\persistence_service.py", line 560, in _fill_and_send_save_game_protobufs_gen&#13;&#10; File "T:\InGame\Gameplay\Scripts\Core\sims4\service_manager.py", line 514, in save_all_services&#13;&#10; File "T:\InGame\Gameplay\Scripts\Server\zone_manager.py", line 118, in save&#13;&#10; File "T:\InGame\Gameplay\Scripts\Server\zone.py", line 1659, in save_zone&#13;&#10; File "T:\InGame\Gameplay\Scripts\Server\game_services.py", line 46, in save_all_services&#13;&#10; File "T:\InGame\Gameplay\Scripts\Core\sims4\service_manager.py", line 514, in save_all_services&#13;&#10; File "T:\InGame\Gameplay\Scripts\Server\fashion_trends\fashion_trend_service.py", line 94, in save&#13;&#10; File "T:\InGame\Gameplay\Scripts\Core\google\protobuf\internal\cpp_message.py", line 149, in extend&#13;&#10; File "T:\InGame\Gameplay\Scripts\Core\google\protobuf\internal\cpp_message.py", line 145, in append&#13;&#10;ValueError: Value out of range: 17461224500453361867rtim=0&#13;&#10;ClientInfo isn't here</desyncdata></report>
<report><version>2</version><sessionid>286bbe9b870bc9e62f2564d</sessionid><type>desync</type><sku>ea.maxis.sims4_64.15.pc</sku><createtime>2022-08-09 18:21:14</createtime><buildsignature>Local.Unknown.Unknown.1.90.375.1020-1.300.000.144.Release</buildsignature><categoryid>cpp_message.py:145</categoryid><desyncid>286bbe9b870bc9e62f2564d</desyncid><systemconfig/><screenshot/><desyncdata>[manus] Save failed due to Exception (ValueError: Value out of range: 17461224500453361867)&#13;&#10;Traceback (most recent call last):&#13;&#10;Caught and logged:&#13;&#10;&#13;&#10; File "T:\InGame\Gameplay\Scripts\Server\services\persistence_service.py", line 560, in _fill_and_send_save_game_protobufs_gen&#13;&#10; File "T:\InGame\Gameplay\Scripts\Core\sims4\service_manager.py", line 514, in save_all_services&#13;&#10; File "T:\InGame\Gameplay\Scripts\Server\zone_manager.py", line 118, in save&#13;&#10; File "T:\InGame\Gameplay\Scripts\Server\zone.py", line 1659, in save_zone&#13;&#10; File "T:\InGame\Gameplay\Scripts\Server\game_services.py", line 46, in save_all_services&#13;&#10; File "T:\InGame\Gameplay\Scripts\Core\sims4\service_manager.py", line 514, in save_all_services&#13;&#10; File "T:\InGame\Gameplay\Scripts\Server\fashion_trends\fashion_trend_service.py", line 94, in save&#13;&#10; File "T:\InGame\Gameplay\Scripts\Core\google\protobuf\internal\cpp_message.py", line 149, in extend&#13;&#10; File "T:\InGame\Gameplay\Scripts\Core\google\protobuf\internal\cpp_message.py", line 145, in append&#13;&#10;ValueError: Value out of range: 17461224500453361867rtim=0&#13;&#10;ClientInfo isn't here</desyncdata></report>
<report><version>2</version><sessionid>286bbe9b870bc9e62f2564d</sessionid><type>desync</type><sku>ea.maxis.sims4_64.15.pc</sku><createtime>2022-08-09 18:28:23</createtime><buildsignature>Local.Unknown.Unknown.1.90.375.1020-1.300.000.144.Release</buildsignature><categoryid>cpp_message.py:145</categoryid><desyncid>286bbe9b870bc9e62f2564d</desyncid><systemconfig/><screenshot/><desyncdata>[manus] Save failed due to Exception (ValueError: Value out of range: 17224306841669434955)&#13;&#10;Traceback (most recent call last):&#13;&#10;Caught and logged:&#13;&#10;&#13;&#10; File "T:\InGame\Gameplay\Scripts\Server\services\persistence_service.py", line 560, in _fill_and_send_save_game_protobufs_gen&#13;&#10; File "T:\InGame\Gameplay\Scripts\Core\sims4\service_manager.py", line 514, in save_all_services&#13;&#10; File "T:\InGame\Gameplay\Scripts\Server\zone_manager.py", line 118, in save&#13;&#10; File "T:\InGame\Gameplay\Scripts\Server\zone.py", line 1659, in save_zone&#13;&#10; File "T:\InGame\Gameplay\Scripts\Server\game_services.py", line 46, in save_all_services&#13;&#10; File "T:\InGame\Gameplay\Scripts\Core\sims4\service_manager.py", line 514, in save_all_services&#13;&#10; File "T:\InGame\Gameplay\Scripts\Server\fashion_trends\fashion_trend_service.py", line 94, in save&#13;&#10; File "T:\InGame\Gameplay\Scripts\Core\google\protobuf\internal\cpp_message.py", line 149, in extend&#13;&#10; File "T:\InGame\Gameplay\Scripts\Core\google\protobuf\internal\cpp_message.py", line 145, in append&#13;&#10;ValueError: Value out of range: 17224306841669434955rtim=0&#13;&#10;ClientInfo isn't here</desyncdata></report>
<report><version>2</version><sessionid>286bbe9b870bc9e62f2564d</sessionid><type>desync</type><sku>ea.maxis.sims4_64.15.pc</sku><createtime>2022-08-09 18:30:15</createtime><buildsignature>Local.Unknown.Unknown.1.90.375.1020-1.300.000.144.Release</buildsignature><categoryid>cpp_message.py:145</categoryid><desyncid>286bbe9b870bc9e62f2564d</desyncid><systemconfig/><screenshot/><desyncdata>[manus] Save failed due to Exception (ValueError: Value out of range: 17224306841669434955)&#13;&#10;Traceback (most recent call last):&#13;&#10;Caught and logged:&#13;&#10;&#13;&#10; File "T:\InGame\Gameplay\Scripts\Server\services\persistence_service.py", line 560, in _fill_and_send_save_game_protobufs_gen&#13;&#10; File "T:\InGame\Gameplay\Scripts\Core\sims4\service_manager.py", line 514, in save_all_services&#13;&#10; File "T:\InGame\Gameplay\Scripts\Server\zone_manager.py", line 118, in save&#13;&#10; File "T:\InGame\Gameplay\Scripts\Server\zone.py", line 1659, in save_zone&#13;&#10; File "T:\InGame\Gameplay\Scripts\Server\game_services.py", line 46, in save_all_services&#13;&#10; File "T:\InGame\Gameplay\Scripts\Core\sims4\service_manager.py", line 514, in save_all_services&#13;&#10; File "T:\InGame\Gameplay\Scripts\Server\fashion_trends\fashion_trend_service.py", line 94, in save&#13;&#10; File "T:\InGame\Gameplay\Scripts\Core\google\protobuf\internal\cpp_message.py", line 149, in extend&#13;&#10; File "T:\InGame\Gameplay\Scripts\Core\google\protobuf\internal\cpp_message.py", line 145, in append&#13;&#10;ValueError: Value out of range: 17224306841669434955rtim=0&#13;&#10;ClientInfo isn't here</desyncdata></report>
<report><version>2</version><sessionid>286bbe9b870bc9e62f2564d</sessionid><type>desync</type><sku>ea.maxis.sims4_64.15.pc</sku><createtime>2022-08-09 18:30:26</createtime><buildsignature>Local.Unknown.Unknown.1.90.375.1020-1.300.000.144.Release</buildsignature><categoryid>cpp_message.py:145</categoryid><desyncid>286bbe9b870bc9e62f2564d</desyncid><systemconfig/><screenshot/><desyncdata>[manus] Save failed due to Exception (ValueError: Value out of range: 17224306841669434955)&#13;&#10;Traceback (most recent call last):&#13;&#10;Caught and logged:&#13;&#10;&#13;&#10; File "T:\InGame\Gameplay\Scripts\Server\services\persistence_service.py", line 560, in _fill_and_send_save_game_protobufs_gen&#13;&#10; File "T:\InGame\Gameplay\Scripts\Core\sims4\service_manager.py", line 514, in save_all_services&#13;&#10; File "T:\InGame\Gameplay\Scripts\Server\zone_manager.py", line 118, in save&#13;&#10; File "T:\InGame\Gameplay\Scripts\Server\zone.py", line 1659, in save_zone&#13;&#10; File "T:\InGame\Gameplay\Scripts\Server\game_services.py", line 46, in save_all_services&#13;&#10; File "T:\InGame\Gameplay\Scripts\Core\sims4\service_manager.py", line 514, in save_all_services&#13;&#10; File "T:\InGame\Gameplay\Scripts\Server\fashion_trends\fashion_trend_service.py", line 94, in save&#13;&#10; File "T:\InGame\Gameplay\Scripts\Core\google\protobuf\internal\cpp_message.py", line 149, in extend&#13;&#10; File "T:\InGame\Gameplay\Scripts\Core\google\protobuf\internal\cpp_message.py", line 145, in append&#13;&#10;ValueError: Value out of range: 17224306841669434955rtim=0&#13;&#10;ClientInfo isn't here</desyncdata></report>
<report><version>2</version><sessionid>286bbe9b870bc9e62f2564d</sessionid><type>desync</type><sku>ea.maxis.sims4_64.15.pc</sku><createtime>2022-08-09 18:31:33</createtime><buildsignature>Local.Unknown.Unknown.1.90.375.1020-1.300.000.144.Release</buildsignature><categoryid>cpp_message.py:145</categoryid><desyncid>286bbe9b870bc9e62f2564d</desyncid><systemconfig/><screenshot/><desyncdata>[manus] Save failed due to Exception (ValueError: Value out of range: 17224306841669434955)&#13;&#10;Traceback (most recent call last):&#13;&#10;Caught and logged:&#13;&#10;&#13;&#10; File "T:\InGame\Gameplay\Scripts\Server\services\persistence_service.py", line 560, in _fill_and_send_save_game_protobufs_gen&#13;&#10; File "T:\InGame\Gameplay\Scripts\Core\sims4\service_manager.py", line 514, in save_all_services&#13;&#10; File "T:\InGame\Gameplay\Scripts\Server\zone_manager.py", line 118, in save&#13;&#10; File "T:\InGame\Gameplay\Scripts\Server\zone.py", line 1659, in save_zone&#13;&#10; File "T:\InGame\Gameplay\Scripts\Server\game_services.py", line 46, in save_all_services&#13;&#10; File "T:\InGame\Gameplay\Scripts\Core\sims4\service_manager.py", line 514, in save_all_services&#13;&#10; File "T:\InGame\Gameplay\Scripts\Server\fashion_trends\fashion_trend_service.py", line 94, in save&#13;&#10; File "T:\InGame\Gameplay\Scripts\Core\google\protobuf\internal\cpp_message.py", line 149, in extend&#13;&#10; File "T:\InGame\Gameplay\Scripts\Core\google\protobuf\internal\cpp_message.py", line 145, in append&#13;&#10;ValueError: Value out of range: 17224306841669434955rtim=0&#13;&#10;ClientInfo isn't here</desyncdata></report>
</root>
Message 96 of 201 (6,306 Views)
0

Re: Save Error 532

[ Edited ]
★★★ Novice

Hi Nick i need help i also have the same issue  i cant save my game forgive me for the bad photo i can't get it clearer

cpp_message
Reason	[manus] Save failed due to Exception (ValueError: Value out of range: 11512330062286387858)

BE-ExceptionReport-20220809-164042.html


@SimGuruNick wrote:

Could anyone encountering this issue possibly share a save file where you've seen it occur? You can DM me the link to your save. Also, are you getting a LastException file when reproducing this error code? The LastException file would be in \Documents\Electronic Arts\The Sims 4, if I could get a copy of that too that'd be great, thanks!

 

Instructions for sharing your files: http://answers.ea.com/t5/The-Sims-4-Bug-Reports/INFORMATION-How-to-Send-User-Files-to-The-Sims-4-Tea...



@SimGuruNick wrote:

Could anyone encountering this issue possibly share a save file where you've seen it occur? You can DM me the link to your save. Also, are you getting a LastException file when reproducing this error code? The LastException file would be in \Documents\Electronic Arts\The Sims 4, if I could get a copy of that too that'd be great, thanks!

 

Instructions for sharing your files: http://answers.ea.com/t5/The-Sims-4-Bug-Reports/INFORMATION-How-to-Send-User-Files-to-The-Sims-4-Tea...



@SimGuruNick wrote:

Could anyone encountering this issue possibly share a save file where you've seen it occur? You can DM me the link to your save. Also, are you getting a LastException file when reproducing this error code? The LastException file would be in \Documents\Electronic Arts\The Sims 4, if I could get a copy of that too that'd be great, thanks!

 

Instructions for sharing your files: http://answers.ea.com/t5/The-Sims-4-Bug-Reports/INFORMATION-How-to-Send-User-Files-to-The-Sims-4-Tea...


 

Message 97 of 201 (6,766 Views)
0

Save Fail Error Code 532

★★★ Newbie

Product: The Sims 4
Platform:Steam-PC
Which language are you playing the game in? English
How often does the bug occur? Every time (100%)
What is your current game version number? Latest, fully updated
What expansions, game packs, and stuff packs do you have installed? Basically all the expansion packs, kits and stuff packs
Steps: How can we find the bug ourselves? It just happens when I try save my game
What happens when the bug occurs? It just happens when I try save my game
What do you expect to see? It should save normally with no error
Have you installed any customization with the game, e.g. Custom Content or Mods? Not now. I've removed them.
Did this issue appear after a specific patch or change you made to your system? Neutral/Not Sure 

I keep getting this error while saving my game. Have done a lot of trouble shooting, removing mods/CC, saving as a new game, repairing the game on origin, playing with another family etc but it just keeps coming back and I am at a complete loss as to why. Any advice would be most welcome!

 

 

Message 98 of 201 (6,740 Views)
0
Highlighted

Re: [CURRENT ISSUE] Save Error 532

★ Guide

After some investigation and some guess work on my part, I am pretty certain I know the cause of the error. Or at least the primary cause of the error that I've encountered most often.

The way Trendi inventory works is that whatever CAS Parts (the items in CAS provided to you) are currently available at the time you save, get written into the save file. The problem is that, from what I can tell (the exact size I am unsure of as there's no easy way to tell), CC CAS part IDs are all 64 bit (at least, if they are made according to "standard") and 64 bits is too big -- the game expects something no bigger than 32 bits (but it may even be 16 bits, as I said, I cannot tell the exact size) -- and thus the save operation fails.

Now you may be asking, "how come everyone with CC isn't getting this error then?" and that's a very interesting question! I wasn't sure myself until recently. Any CC with any of the new Fashion rarity tags WILL BREAK THE TRENDI SYSTEM AND CAUSE THE GAME TO FAIL TO BE ABLE TO SAVE. Because these tags are new with the patch, not a lot of CC will have any of these tags, but there are some items already going around with some of new tags, and they're causing the current issue. (I also know of a tutorial showing people how to add the tag to CC, which means that the problem may spread...)

Ultimately, it is up to EA if they find this issue problematic enough to "fix" by extending the allowable bit size of the CAS parts when being written to a save file or not. As far as finding the CC that is causing the issue -- to remove it at least for the time being, or to remove the tags yourself -- it will most likely be something dated from after the patch.

Message 99 of 201 (6,522 Views)

Re: [CURRENT ISSUE] Save Error 532

★ Apprentice
@leroidetout Yes, that helped! Time is flying again Standard smile TY. (I had test edited some medieval separates and changed them back to no tags relating to the trendy system.) Now even saves I thought was corrupted seem to work.
Message 100 of 201 (5,803 Views)
0
Twitter Stream
sims-all-characters

Want more Sims?

Check out our Sims forums for tutorials and all things Sims.

View more

ts4-promo

Having trouble connecting to your game?

Try these steps first to clear up any problems you may have when connecting to an EA game.

Troubleshoot and test your connection

ts4-promo

Forget your EA Account ID or password?

Reset, update, or link your account information.

View More on EA Help